j***@163.com
j***@163.com
  • 发布:2023-05-23 09:44
  • 更新:2024-04-18 14:38
  • 阅读:1964

打包ios出现错误,这个是什么情况???急急急

分类:uni-app

Appid: UNI837E302
Command line invocation:
/Applications/Xcode.app/Contents/Developer/usr/bin/xcodebuild -sdk iphoneos16.2 -project [PackagePath]/HBuilder.xcodeproj

User defaults from command line:
IDEPackageSupportUseBuiltinSCM = YES

Build settings from command line:
SDKROOT = iphoneos16.2

Computing target dependency graph and provisioning inputs

Create build description
Build description signature: a47e86ff666228eb86b06d1c2fac2c28
Build description path: [PackagePath]/build/XCBuildData/a47e86ff666228eb86b06d1c2fac2c28-desc.xcbuild

warning: Building targets in manual order is deprecated - check \"Parallelize build for command-line builds\" in the project editor, or set DISABLE_MANUAL_TARGET_ORDER_BUILD_WARNING in any of the targets in the current build to suppress this warning
[PackagePath]/HBuilder.xcodeproj: warning: The iOS deployment target 'IPHONEOS_DEPLOYMENT_TARGET' is set to 9.0, but the range of supported deployment target versions is 11.0 to 16.2.99. (in target 'HBuilder' from project 'HBuilder')
[PackagePath]/HBuilder.xcodeproj: error: Provisioning profile \"jike\" doesn't support the Sign in with Apple capability. (in target 'HBuilder' from project 'HBuilder')
[PackagePath]/HBuilder.xcodeproj: error: Provisioning profile \"jike\" doesn't include the com.apple.developer.applesignin entitlement. Profile qualification is using entitlement definitions that may be out of date. Connect to network to update. (in target 'HBuilder' from project 'HBuilder')
warning: Run script build phase 'Run Script' will be run during every build because it does not specify any outputs. To address this warning, either add output dependencies to the script phase, or configure it to run in every build by unchecking \"Based on dependency analysis\" in the script phase. (in target 'HBuilder' from project 'HBuilder') BUILD FAILED

2023-05-23 09:44 负责人:无 分享
已邀请:
BoredApe

BoredApe - 有问题就会有答案。

FullStack

FullStack - 【插件开发】【专治疑难杂症】【ios上架、马甲包、白包、过审、已成功上架过几百个】【多款插件已上架:https://ext.dcloud.net.cn/publisher?id=22130】【非诚勿扰】QQ:543610866

  • j***@163.com (作者)

    但是我加了 deploymentTarget:11.0这个配置 IOS打包是还是不对

    2023-05-24 09:45

  • FullStack

    回复 j***@163.com: [PackagePath]/HBuilder.xcodeproj:警告:iOS部署目标“IPHONEOS_deployment_target”设置为9.0,但支持的部署目标版本范围为11.0到16.2.99。(在项目“HBuilder”的目标“HBuildr”中)


    [PackagePath]/HBuilder.xcodeproj:错误:设置配置文件\“jike\”不支持使用Apple登录功能。(在项目“HBuilder”的目标“HBuildr”中)


    [PackagePath]/HBuilder.xcodeproj:错误:设置配置文件\“jike\”不包括com.apple.developer.applesignin权限。配置文件资格验证使用的权限定义可能已过期。连接到网络进行更新。

    2023-05-24 09:48

  • j***@163.com (作者)

    回复 FullStack: 那我应该怎么操作,我第一次ios打包,

    2023-05-24 09:53

j***@163.com

j***@163.com (作者)

Appid: UNI837E302
Command line invocation:
/Applications/Xcode.app/Contents/Developer/usr/bin/xcodebuild -sdk iphoneos16.2 -project [PackagePath]/HBuilder.xcodeproj

User defaults from command line:
IDEPackageSupportUseBuiltinSCM = YES

Build settings from command line:
SDKROOT = iphoneos16.2

Computing target dependency graph and provisioning inputs

Create build description
Build description signature: 05c6659bdee2d7c3efa306ff7db54e30
Build description path: [PackagePath]/build/XCBuildData/05c6659bdee2d7c3efa306ff7db54e30-desc.xcbuild

warning: Building targets in manual order is deprecated - check \"Parallelize build for command-line builds\" in the project editor, or set DISABLE_MANUAL_TARGET_ORDER_BUILD_WARNING in any of the targets in the current build to suppress this warning
[PackagePath]/HBuilder.xcodeproj: warning: The iOS deployment target 'IPHONEOS_DEPLOYMENT_TARGET' is set to 9.0, but the range of supported deployment target versions is 11.0 to 16.2.99. (in target 'HBuilder' from project 'HBuilder')
[PackagePath]/HBuilder.xcodeproj: error: Provisioning profile \"jike\" doesn't support the Sign in with Apple capability. (in target 'HBuilder' from project 'HBuilder')
[PackagePath]/HBuilder.xcodeproj: error: Provisioning profile \"jike\" doesn't include the com.apple.developer.applesignin entitlement. Profile qualification is using entitlement definitions that may be out of date. Connect to network to update. (in target 'HBuilder' from project 'HBuilder')
warning: Run script build phase 'Run Script' will be run during every build because it does not specify any outputs. To address this warning, either add output dependencies to the script phase, or configure it to run in every build by unchecking \"Based on dependency analysis\" in the script phase. (in target 'HBuilder' from project 'HBuilder') BUILD FAILED

  • 3***@qq.com

    老铁 解决了吗?我和你一模一样的错误

    2023-06-21 16:54

1***@qq.com

1***@qq.com - 0.0

这个问题有人解决了吗

  • BoredApe

    发错误日志链接

    2023-08-14 08:39

  • 1***@qq.com

    回复 BoredApe: 你好 可以帮我看一下这个吗?https://ide.dcloud.net.cn/build/errorLog/bcb23240-3bfb-11ee-af16-7fe9b0be4a08

    2023-08-16 16:20

  • BoredApe

    回复 1***@qq.com: ```

    warning: Building targets in manual order is deprecated - check \"Parallelize build for command-line builds\" in the project editor, or set DISABLE_MANUAL_TARGET_ORDER_BUILD_WARNING in any of the targets in the current build to suppress this warning

    [PackagePath]/HBuilder.xcodeproj: warning: The iOS deployment target 'IPHONEOS_DEPLOYMENT_TARGET' is set to 9.0, but the range of supported deployment target versions is 11.0 to 16.4.99. (in target 'HBuilder' from project 'HBuilder')

    [PackagePath]/HBuilder.xcodeproj: error: Provisioning profile \"haohuangAPP\" doesn't support the Associated Domains capability. (in target 'HBuilder' from project 'HBuilder')

    [PackagePath]/HBuilder.xcodeproj: error: Provisioning profile \"haohuangAPP\" doesn't include the com.apple.developer.associated-domains entitlement. Profile qualification is using entitlement definitions that may be out of date. Connect to network to update. (in target 'HBuilder' from project 'HBuilder')



    参考文档:[iOS云打包如何设置通用链接等Capabilities配置](https://ask.dcloud.net.cn/article/36393)
    ***开启```Associated Domains```服务后需要重新生成```profile```文件***

    2023-08-16 16:21

小胡不太会

小胡不太会

https://ide.dcloud.net.cn/build/errorLog/4e6057b0-ae13-11ee-9678-377ecdcbd1cc 能不能帮忙看着 这个打包错误怎么解决啊

3***@qq.com

3***@qq.com

https://ide.dcloud.net.cn/build/errorLog/2b238590-b4d6-11ee-9207-bdce16837160 ,各位大佬麻烦帮我看一下这个打包错误怎么解决

  • II优选

    Signing certificate is invalid. Signing certificate \"iPhone Distribution: Ningbo Huifeng Human Resources Service Co Ltd (J4286F6KHQ)\", serial number \"14796C893B25CA89D6764D0A1D8E6202\", is not valid for code signing. It may have been revoked or expired. (in target 'HBuilder' from project 'HBuilder')


    证书过期了,重新生成证书

    2024-01-17 09:43

  • 3***@qq.com

    回复 II优选: 好的,谢谢

    2024-01-17 09:49

  • iOSDeveloper

    回复 3***@qq.com: 解决了没

    2024-01-17 10:11

  • 3***@qq.com

    回复 iOSDeveloper: 解决了

    2024-01-17 10:54

  • iOSDeveloper

    回复 3***@qq.com: 顺利上架AppStore了?

    2024-01-17 10:55

iOSDeveloper

iOSDeveloper - 专注于iOS相关领域。联系QQ:752562065

解决了嘛?

o***@163.com

o***@163.com

https://app.liuyingyong.cn/build/errorLog/b34b91c0-f0cf-11ee-8a53-d36e9775d470,各位大佬帮忙看下,
图中这个也选了,还是打包失败

  • iOSDeveloper

    错误信息地址不存在

    2024-04-02 17:13

  • o***@163.com

    回复 iOSDeveloper: warning: Run script build phase 'Run Script' will be run during every build because it does not specify any outputs. To address this warning, either add output dependencies to the script phase, or configure it to run in every build by unchecking \"Based on dependency analysis\" in the script phase. (in target 'HBuilder' from project 'HBuilder')--- xcodebuild: WARNING: Using the first of multiple matching destinations:

    { platform:iOS, id:dvtdevice-DVTiPhonePlaceholder-iphoneos:placeholder, name:Any iOS Device }

    { platform:macOS, arch:arm64, variant:Designed for [iPad,iPhone], id:00008112-000D29A41AFB401E }

    { platform:iOS Simulator, id:dvtdevice-DVTiOSDeviceSimulatorPlaceholder-iphonesimulator:placeholder, name:Any iOS Simulator Device }

    { platform:iOS Simulator, id:D0995472-7DCA-4B75-94CB-36790607A347, OS:17.2, name:iPad (10th generation) }

    { platform:iOS Simulator, id:D0995472-7DCA-4B75-94CB-36790607A347, OS:17.2, name:iPad (10th generation) }

    { platform:iOS Simulator, id:FEF882E5-6D59-4258-A360-A5AB7088F137, OS:17.2, name:iPad Air (5th generation) }

    { platform:iOS Simulator, id:FEF882E5-6D59-4258-A360-A5AB7088F137, OS:17.2, name:iPad Air (5th generation) }

    { platform:iOS Simulator, id:46FD9851-6B75-4B63-9994-7323454CD5B6, OS:17.2, name:iPad Pro (11-inch) (4th generation) }

    { platform:iOS Simulator, id:46FD9851-6B75-4B63-9994-7323454CD5B6, OS:17.2, name:iPad Pro (11-inch) (4th generation) }

    { platform:iOS Simulator, id:F6E43BF4-CEDA-403A-BA34-633EFE70B6BC, OS:17.2, name:iPad Pro (12.9-inch) (6th generation) }

    { platform:iOS Simulator, id:F6E43BF4-CEDA-403A-BA34-633EFE70B6BC, OS:17.2, name:iPad Pro (12.9-inch) (6th generation) }

    { platform:iOS Simulator, id:94B3B082-032E-4F34-ACC3-79AE0B77EBCD, OS:17.2, name:iPad mini (6th generation) }

    { platform:iOS Simulator, id:94B3B082-032E-4F34-ACC3-79AE0B77EBCD, OS:17.2, name:iPad mini (6th generation) }

    { platform:iOS Simulator, id:58F69B9D-009C-4FBE-A162-4C410E336300, OS:17.2, name:iPhone 15 }

    { platform:iOS Simulator, id:58F69B9D-009C-4FBE-A162-4C410E336300, OS:17.2, name:iPhone 15 }

    { platform:iOS Simulator, id:4B79CD15-3A70-45B4-8997-1572E446370A, OS:17.2, name:iPhone 15 Plus }

    { platform:iOS Simulator, id:4B79CD15-3A70-45B4-8997-1572E446370A, OS:17.2, name:iPhone 15 Plus }

    { platform:iOS Simulator, id:C059A0AA-01D5-4629-A8B3-D6E2D41E8D30, OS:17.2, name:iPhone 15 Pro }

    { platform:iOS Simulator, id:C059A0AA-01D5-4629-A8B3-D6E2D41E8D30, OS:17.2, name:iPhone 15 Pro }

    { platform:iOS Simulator, id:527666E3-2DA8-4634-9E83-AE13C009EAF3, OS:17.2, name:iPhone 15 Pro Max }

    { platform:iOS Simulator, id:527666E3-2DA8-4634-9E83-AE13C009EAF3, OS:17.2, name:iPhone 15 Pro Max }

    { platform:iOS Simulator, id:3FC7B39D-0020-4171-8F2C-86477A1B1BED, OS:17.2, name:iPhone SE (3rd generation) }

    { platform:iOS Simulator, id:3FC7B39D-0020-4171-8F2C-86477A1B1BED, OS:17.2, name:iPhone SE (3rd generation) }

    ARCHIVE FAILED The following build commands failed:

    Ld /Users/[Name]/Library/Developer/Xcode/DerivedData/HBuilder-fikowhhdwfbpeabdlqxvqylphrvx/Build/Intermediates.noindex/ArchiveIntermediates/HBuilder/InstallationBuildProductsLocation/Applications/HBuilder.app/HBuilder normal (in target 'HBuilder' from project 'HBuilder')

    (1 failure)

    2024-04-02 17:17

  • iOSDeveloper

    回复 o***@163.com: 长度有限,应该是有部分没复制上来,加一下我好友吧,远程看一下

    2024-04-02 18:14

  • jjz

    回复 o***@163.com: 解决了吗

    2024-04-17 16:34

平凡开发者

平凡开发者

求求大佬帮忙看下这是怎么回事
User defaults from command line:
IDEArchivePathOverride = [PackagePath]/XArchive/HBuilder.xcarchive
IDEPackageSupportUseBuiltinSCM = YES

Build settings from command line:
SDKROOT = iphoneos17.2

Prepare packages

ComputeTargetDependencyGraph
note: Building targets in dependency order
note: Target dependency graph (1 target)
Target 'HBuilder' in project 'HBuilder' (no dependencies)

GatherProvisioningInputs

CreateBuildDescription
Build description signature: 7bb768db78a7b563edaa3552beb92da8
Build description path: /Users/[Name]/Library/Developer/Xcode/DerivedData/HBuilder-ezraxxhmwouwigamcniemsyduuzz/Build/Intermediates.noindex/ArchiveIntermediates/HBuilder/IntermediateBuildFilesPath/XCBuildData/7bb768db78a7b563edaa3552beb92da8.xcbuilddata

[PackagePath]/HBuilder.xcodeproj: error: Provisioning profile \"devl\" doesn't support the Sign in with Apple capability. (in target 'HBuilder' from project 'HBuilder')
[PackagePath]/HBuilder.xcodeproj: error: Provisioning profile \"devl\" doesn't include the com.apple.developer.applesignin entitlement. Profile qualification is using entitlement definitions that may be out of date. Connect to network to update. (in target 'HBuilder' from project 'HBuilder')
warning: Run script build phase 'Run Script' will be run during every build because it does not specify any outputs. To address this warning, either add output dependencies to the script phase, or configure it to run in every build by unchecking \"Based on dependency analysis\" in the script phase. (in target 'HBuilder' from project 'HBuilder')--- xcodebuild: WARNING: Using the first of multiple matching destinations:
{ platform:iOS, id:dvtdevice-DVTiPhonePlaceholder-iphoneos:placeholder, name:Any iOS Device }
{ platform:macOS, arch:arm64, variant:Designed for [iPad,iPhone], id:00008112-001214A41AFB401E }
{ platform:iOS Simulator, id:dvtdevice-DVTiOSDeviceSimulatorPlaceholder-iphonesimulator:placeholder, name:Any iOS Simulator Device }
{ platform:iOS Simulator, id:BBD81879-A43E-42FA-8836-430D8E6AB8FB, OS:17.2, name:iPad (10th generation) }
{ platform:iOS Simulator, id:BBD81879-A43E-42FA-8836-430D8E6AB8FB, OS:17.2, name:iPad (10th generation) }
{ platform:iOS Simulator, id:A9FDFCF6-79C4-4C46-AE8F-FEF32A94DABB, OS:17.2, name:iPad Air (5th generation) }
{ platform:iOS Simulator, id:A9FDFCF6-79C4-4C46-AE8F-FEF32A94DABB, OS:17.2, name:iPad Air (5th generation) }
{ platform:iOS Simulator, id:95CB7F6B-22D9-473B-B548-5EB83C3EF469, OS:17.2, name:iPad Pro (11-inch) (4th generation) }
{ platform:iOS Simulator, id:95CB7F6B-22D9-473B-B548-5EB83C3EF469, OS:17.2, name:iPad Pro (11-inch) (4th generation) }
{ platform:iOS Simulator, id:917F047D-C489-4BDA-A21B-F13ACC431CBB, OS:17.2, name:iPad Pro (12.9-inch) (6th generation) }
{ platform:iOS Simulator, id:917F047D-C489-4BDA-A21B-F13ACC431CBB, OS:17.2, name:iPad Pro (12.9-inch) (6th generation) }
{ platform:iOS Simulator, id:C5852BDE-BBB9-440B-9895-C006AE46A9F9, OS:17.2, name:iPad mini (6th generation) }
{ platform:iOS Simulator, id:C5852BDE-BBB9-440B-9895-C006AE46A9F9, OS:17.2, name:iPad mini (6th generation) }
{ platform:iOS Simulator, id:3D84D59D-95D0-4672-BFF3-16BE392A8983, OS:17.2, name:iPhone 15 }
{ platform:iOS Simulator, id:3D84D59D-95D0-4672-BFF3-16BE392A8983, OS:17.2, name:iPhone 15 }
{ platform:iOS Simulator, id:0A5BC4C8-81AC-4F7A-8FAD-2709863BB650, OS:17.2, name:iPhone 15 Plus }
{ platform:iOS Simulator, id:0A5BC4C8-81AC-4F7A-8FAD-2709863BB650, OS:17.2, name:iPhone 15 Plus }
{ platform:iOS Simulator, id:BC20CDBB-81B6-44B0-8561-AD09AB6D51BE, OS:17.2, name:iPhone 15 Pro }
{ platform:iOS Simulator, id:BC20CDBB-81B6-44B0-8561-AD09AB6D51BE, OS:17.2, name:iPhone 15 Pro }
{ platform:iOS Simulator, id:655BB5D6-F361-462B-AEE2-57ECCFF39FDB, OS:17.2, name:iPhone 15 Pro Max }
{ platform:iOS Simulator, id:655BB5D6-F361-462B-AEE2-57ECCFF39FDB, OS:17.2, name:iPhone 15 Pro Max }
{ platform:iOS Simulator, id:B8282E36-D56A-4690-8CFA-CFA0C443A85E, OS:17.2, name:iPhone SE (3rd generation) }
{ platform:iOS Simulator, id:B8282E36-D56A-4690-8CFA-CFA0C443A85E, OS:17.2, name:iPhone SE (3rd generation) }
ARCHIVE FAILED

  • iOSDeveloper

    你这个一看就是没有勾选Apple Sign的问题

    2024-04-18 14:41

  • 平凡开发者

    回复 iOSDeveloper: 嗯,是的证书没勾选Apple Sign,已解决,谢谢

    2024-04-24 16:14

要回复问题请先登录注册