qingyou
qingyou
  • 发布:2023-08-03 17:43
  • 更新:2023-08-04 09:01
  • 阅读:198

Execution failed for task ':app:checkReleaseDuplicateClasses'. 打自定义基座报错 之前没有出现过 更换APPID后打自定义基座出现问题

分类:uni-app

Appid: UNIB***
Warning: Mapping new ns http://schemas.android.com/repository/android/common/02 to old ns http://schemas.android.com/repository/android/common/01
Warning: Mapping new ns http://schemas.android.com/repository/android/generic/02 to old ns http://schemas.android.com/repository/android/generic/01
Warning: Mapping new ns http://schemas.android.com/sdk/android/repo/addon2/02 to old ns http://schemas.android.com/sdk/android/repo/addon2/01
Warning: Mapping new ns http://schemas.android.com/sdk/android/repo/addon2/03 to old ns http://schemas.android.com/sdk/android/repo/addon2/01
Warning: Mapping new ns http://schemas.android.com/sdk/android/repo/repository2/02 to old ns http://schemas.android.com/sdk/android/repo/repository2/01
Warning: Mapping new ns http://schemas.android.com/sdk/android/repo/repository2/03 to old ns http://schemas.android.com/sdk/android/repo/repository2/01
Warning: Mapping new ns http://schemas.android.com/sdk/android/repo/sys-img2/03 to old ns http://schemas.android.com/sdk/android/repo/sys-img2/01
Warning: Mapping new ns http://schemas.android.com/sdk/android/repo/sys-img2/02 to old ns http://schemas.android.com/sdk/android/repo/sys-img2/01
Warning: unexpected element (uri:\"\", local:\"base-extension\"). Expected elements are <{}codename>,<{}layoutlib>,<{}api-level>

FAILURE: Build failed with an exception.

  • What went wrong:
    Execution failed for task ':app:checkReleaseDuplicateClasses'.

    A failure occurred while executing com.android.build.gradle.internal.tasks.CheckDuplicatesRunnable
    Duplicate class com.hjq.permissions.AndroidManifestInfo found in modules jetified-XXPermissions-18.0-runtime (com.github.getActivity:XXPermissions:18.0) and jetified-utsplugin-release-runtime (utsplugin-release.aar)
    Duplicate class com.hjq.permissions.AndroidManifestInfo$ActivityInfo found in modules jetified-XXPermissions-18.0-runtime (com.github.getActivity:XXPermissions:18.0) and jetified-utsplugin-release-runtime (utsplugin-release.aar)
    Duplicate class com.hjq.permissions.AndroidManifestInfo$ApplicationInfo found in modules jetified-XXPermissions-18.0-runtime (com.github.getActivity:XXPermissions:18.0) and jetified-utsplugin-release-runtime (utsplugin-release.aar)
    Duplicate class com.hjq.permissions.AndroidManifestInfo$PermissionInfo found in modules jetified-XXPermissions-18.0-runtime (com.github.getActivity:XXPermissions:18.0) and jetified-utsplugin-release-runtime (utsplugin-release.aar)
    Duplicate class com.hjq.permissions.AndroidManifestInfo$ServiceInfo found in modules jetified-XXPermissions-18.0-runtime (com.github.getActivity:XXPermissions:18.0) and jetified-utsplugin-release-runtime (utsplugin-release.aar)
    Duplicate class com.hjq.permissions.AndroidManifestInfo$UsesSdkInfo found in modules jetified-XXPermissions-18.0-runtime (com.github.getActivity:XXPermissions:18.0) and jetified-utsplugin-release-runtime (utsplugin-release.aar)
    Duplicate class com.hjq.permissions.AndroidManifestParser found in modules jetified-XXPermissions-18.0-runtime (com.github.getActivity:XXPermissions:18.0) and jetified-utsplugin-release-runtime (utsplugin-release.aar)
    Duplicate class com.hjq.permissions.AndroidVersion found in modules jetified-XXPermissions-18.0-runtime (com.github.getActivity:XXPermissions:18.0) and jetified-utsplugin-release-runtime (utsplugin-release.aar)
    Duplicate class com.hjq.permissions.GetInstalledAppsPermissionCompat found in modules jetified-XXPermissions-18.0-runtime (com.github.getActivity:XXPermissions:18.0) and jetified-utsplugin-release-runtime (utsplugin-release.aar)
    Duplicate class com.hjq.permissions.IPermissionInterceptor found in modules jetified-XXPermissions-18.0-runtime (com.github.getActivity:XXPermissions:18.0) and jetified-utsplugin-release-runtime (utsplugin-release.aar)
    Duplicate class com.hjq.permissions.NotificationListenerPermissionCompat found in modules jetified-XXPermissions-18.0-runtime (com.github.getActivity:XXPermissions:18.0) and jetified-utsplugin-release-runtime (utsplugin-release.aar)
    Duplicate class com.hjq.permissions.NotificationPermissionCompat found in modules jetified-XXPermissions-18.0-runtime (com.github.getActivity:XXPermissions:18.0) and jetified-utsplugin-release-runtime (utsplugin-release.aar)
    Duplicate class com.hjq.permissions.OnPermissionCallback found in modules jetified-XXPermissions-18.0-runtime (com.github.getActivity:XXPermissions:18.0) and jetified-utsplugin-release-runtime (utsplugin-release.aar)
    Duplicate class com.hjq.permissions.OnPermissionPageCallback found in modules jetified-XXPermissions-18.0-runtime (com.github.getActivity:XXPermissions:18.0) and jetified-utsplugin-release-runtime (utsplugin-release.aar)
    Duplicate class com.hjq.permissions.Permission found in modules jetified-XXPermissions-18.0-runtime (com.github.getActivity:XXPermissions:18.0) and jetified-utsplugin-release-runtime (utsplugin-release.aar)
    Duplicate class com.hjq.permissions.Permission$Group found in modules jetified-XXPermissions-18.0-runtime (com.github.getActivity:XXPermissions:18.0) and jetified-utsplugin-release-runtime (utsplugin-release.aar)
    Duplicate class com.hjq.permissions.PermissionApi found in modules jetified-XXPermissions-18.0-runtime (com.github.getActivity:XXPermissions:18.0) and jetified-utsplugin-release-runtime (utsplugin-release.aar)
    Duplicate class com.hjq.permissions.PermissionChecker found in modules jetified-XXPermissions-18.0-runtime (com.github.getActivity:XXPermissions:18.0) and jetified-utsplugin-release-runtime (utsplugin-release.aar)
    Duplicate class com.hjq.permissions.PermissionDelegate found in modules jetified-XXPermissions-18.0-runtime (com.github.getActivity:XXPermissions:18.0) and jetified-utsplugin-release-runtime (utsplugin-release.aar)
    Duplicate class com.hjq.permissions.PermissionDelegateImplV14 found in modules jetified-XXPermissions-18.0-runtime (com.github.getActivity:XXPermissions:18.0) and jetified-utsplugin-release-runtime (utsplugin-release.aar)
    Duplicate class com.hjq.permissions.PermissionDelegateImplV18 found in modules jetified-XXPermissions-18.0-runtime (com.github.getActivity:XXPermissions:18.0) and jetified-utsplugin-release-runtime (utsplugin-release.aar)
    Duplicate class com.hjq.permissions.PermissionDelegateImplV19 found in modules jetified-XXPermissions-18.0-runtime (com.github.getActivity:XXPermissions:18.0) and jetified-utsplugin-release-runtime (utsplugin-release.aar)
    Duplicate class com.hjq.permissions.PermissionDelegateImplV21 found in modules jetified-XXPermissions-18.0-runtime (com.github.getActivity:XXPermissions:18.0) and jetified-utsplugin-release-runtime (utsplugin-release.aar)
    Duplicate class com.hjq.permissions.PermissionDelegateImplV23 found in modules jetified-XXPermissions-18.0-runtime (com.github.getActivity:XXPermissions:18.0) and jetified-utsplugin-release-runtime (utsplugin-release.aar)
    Duplicate class com.hjq.permissions.PermissionDelegateImplV26 found in modules jetified-XXPermissions-18.0-runtime (com.github.getActivity:XXPermissions:18.0) and jetified-utsplugin-release-runtime (utsplugin-release.aar)
    Duplicate class com.hjq.permissions.PermissionDelegateImplV28 found in modules jetified-XXPermissions-18.0-runtime (com.github.getActivity:XXPermissions:18.0) and jetified-utsplugin-release-runtime (utsplugin-release.aar)
    Duplicate class com.hjq.permissions.PermissionDelegateImplV29 found in modules jetified-XXPermissions-18.0-runtime (com.github.getActivity:XXPermissions:18.0) and jetified-utsplugin-release-runtime (utsplugin-release.aar)
    Duplicate class com.hjq.permissions.PermissionDelegateImplV30 found in modules jetified-XXPermissions-18.0-runtime (com.github.getActivity:XXPermissions:18.0) and jetified-utsplugin-release-runtime (utsplugin-release.aar)
    Duplicate class com.hjq.permissions.PermissionDelegateImplV31 found in modules jetified-XXPermissions-18.0-runtime (com.github.getActivity:XXPermissions:18.0) and jetified-utsplugin-release-runtime (utsplugin-release.aar)
    Duplicate class com.hjq.permissions.PermissionDelegateImplV33 found in modules jetified-XXPermissions-18.0-runtime (com.github.getActivity:XXPermissions:18.0) and jetified-utsplugin-release-runtime (utsplugin-release.aar)
    Duplicate class com.hjq.permissions.PermissionFragment found in modules jetified-XXPermissions-18.0-runtime (com.github.getActivity:XXPermissions:18.0) and jetified-utsplugin-release-runtime (utsplugin-release.aar)
    Duplicate class com.hjq.permissions.PermissionFragment$1 found in modules jetified-XXPermissions-18.0-runtime (com.github.getActivity:XXPermissions:18.0) and jetified-utsplugin-release-runtime (utsplugin-release.aar)
    Duplicate class com.hjq.permissions.PermissionFragment$2 found in modules jetified-XXPermissions-18.0-runtime (com.github.getActivity:XXPermissions:18.0) and jetified-utsplugin-release-runtime (utsplugin-release.aar)
    Duplicate class com.hjq.permissions.PermissionFragment$2$1 found in modules jetified-XXPermissions-18.0-runtime (com.github.getActivity:XXPermissions:18.0) and jetified-utsplugin-release-runtime (utsplugin-release.aar)
    Duplicate class com.hjq.permissions.PermissionFragment$2$2 found in modules jetified-XXPermissions-18.0-runtime (com.github.getActivity:XXPermissions:18.0) and jetified-utsplugin-release-runtime (utsplugin-release.aar)
    Duplicate class com.hjq.permissions.PermissionIntentManager found in modules jetified-XXPermissions-18.0-runtime (com.github.getActivity:XXPermissions:18.0) and jetified-utsplugin-release-runtime (utsplugin-release.aar)
    Duplicate class com.hjq.permissions.PermissionPageFragment found in modules jetified-XXPermissions-18.0-runtime (com.github.getActivity:XXPermissions:18.0) and jetified-utsplugin-release-runtime (utsplugin-release.aar)
    Duplicate class com.hjq.permissions.PermissionUtils found in modules jetified-XXPermissions-18.0-runtime (com.github.getActivity:XXPermissions:18.0) and jetified-utsplugin-release-runtime (utsplugin-release.aar)
    Duplicate class com.hjq.permissions.PhoneRomUtils found in modules jetified-XXPermissions-18.0-runtime (com.github.getActivity:XXPermissions:18.0) and jetified-utsplugin-release-runtime (utsplugin-release.aar)
    Duplicate class com.hjq.permissions.StartActivityManager found in modules jetified-XXPermissions-18.0-runtime (com.github.getActivity:XXPermissions:18.0) and jetified-utsplugin-release-runtime (utsplugin-release.aar)
    Duplicate class com.hjq.permissions.StartActivityManager$1 found in modules jetified-XXPermissions-18.0-runtime (com.github.getActivity:XXPermissions:18.0) and jetified-utsplugin-release-runtime (utsplugin-release.aar)
    Duplicate class com.hjq.permissions.StartActivityManager$IStartActivityDelegate found in modules jetified-XXPermissions-18.0-runtime (com.github.getActivity:XXPermissions:18.0) and jetified-utsplugin-release-runtime (utsplugin-release.aar)
    Duplicate class com.hjq.permissions.StartActivityManager$StartActivityDelegateActivityImpl found in modules jetified-XXPermissions-18.0-runtime (com.github.getActivity:XXPermissions:18.0) and jetified-utsplugin-release-runtime (utsplugin-release.aar)
    Duplicate class com.hjq.permissions.StartActivityManager$StartActivityDelegateContextImpl found in modules jetified-XXPermissions-18.0-runtime (com.github.getActivity:XXPermissions:18.0) and jetified-utsplugin-release-runtime (utsplugin-release.aar)
    Duplicate class com.hjq.permissions.StartActivityManager$StartActivityDelegateFragmentImpl found in modules jetified-XXPermissions-18.0-runtime (com.github.getActivity:XXPermissions:18.0) and jetified-utsplugin-release-runtime (utsplugin-release.aar)
    Duplicate class com.hjq.permissions.StartActivityManager$StartActivityDelegateSupportFragmentImpl found in modules jetified-XXPermissions-18.0-runtime (com.github.getActivity:XXPermissions:18.0) and jetified-utsplugin-release-runtime (utsplugin-release.aar)
    Duplicate class com.hjq.permissions.WindowPermissionCompat found in modules jetified-XXPermissions-18.0-runtime (com.github.getActivity:XXPermissions:18.0) and jetified-utsplugin-release-runtime (utsplugin-release.aar)
    Duplicate class com.hjq.permissions.XXPermissions found in modules jetified-XXPermissions-18.0-runtime (com.github.getActivity:XXPermissions:18.0) and jetified-utsplugin-release-runtime (utsplugin-release.aar)
    Duplicate class com.hjq.permissions.XXPermissions$1 found in modules jetified-XXPermissions-18.0-runtime (com.github.getActivity:XXPermissions:18.0) and jetified-utsplugin-release-runtime (utsplugin-release.aar)

Go to the documentation to learn how to Fix dependency resolution errors.

  • Try:

    Run with --debug option to get more log output.
    Run with --scan to get full insights.

  • Exception is:
    org.gradle.api.tasks.TaskExecutionException: Execution failed for task ':app:checkReleaseDuplicateClasses'.
    at org.gradle.api.internal.tasks.execution.ExecuteActionsTaskExecuter.lambda$executeIfValid$1(ExecuteActionsTaskExecuter.java:145)
    at org.gradle.internal.Try$Failure.ifSuccessfulOrElse(Try.java:282)
    at org.gradle.api.internal.tasks.execution.ExecuteActionsTaskExecuter.executeIfValid(ExecuteActionsTaskExecuter.java:143)
    at org.gradle.api.internal.tasks.execution.ExecuteActionsTaskExecuter.execute(ExecuteActionsTaskExecuter.java:131)
    at org.gradle.api.internal.tasks.execution.CleanupStaleOutputsExecuter.execute(CleanupStaleOutputsExecuter.java:77)
    at org.gradle.api.internal.tasks.execution.FinalizePropertiesTaskExecuter.execute(FinalizePropertiesTaskExecuter.java:46)
    at org.gradle.api.internal.tasks.execution.ResolveTaskExecutionModeExecuter.execute(ResolveTaskExecutionModeExecuter.java:51)
    at org.gradle.api.internal.tasks.execution.SkipTaskWithNoActionsExecuter.execute(SkipTaskWithNoActionsExecuter.java:57)
    at org.gradle.api.internal.tasks.execution.SkipOnlyIfTaskExecuter.execute(SkipOnlyIfTaskExecuter.java:56)
    at org.gradle.api.internal.tasks.execution.CatchExceptionTaskExecuter.execute(CatchExceptionTaskExecuter.java:36)
    at org.gradle.api.internal.tasks.execution.EventFiringTaskExecuter$1.executeTask(EventFiringTaskExecuter.java:77)
    at org.gradle.api.internal.tasks.execution.EventFiringTaskExecuter$1.call(EventFiringTaskExecuter.java:55)
    at org.gradle.api.internal.tasks.execution.EventFiringTaskExecuter$1.call(EventFiringTaskExecuter.java:52)
    at org.gradle.internal.operations.DefaultBuildOperationRunner$CallableBuildOperationWorker.execute(DefaultBuildOperationRunner.java:204)
    at org.gradle.internal.operations.DefaultBuildOperationRunner$CallableBuildOperationWorker.execute(DefaultBuildOperationRunner.java:199)
    at org.gradle.internal.operations.DefaultBuildOperationRunner$2.execute(DefaultBuildOperationRunner.java:66)
    at org.gradle.internal.operations.DefaultBuildOperationRunner$2.execute(DefaultBuildOperationRunner.java:59)
    at org.gradle.internal.operations.DefaultBuildOperationRunner.execute(DefaultBuildOperationRunner.java:157)
    at org.gradle.internal.operations.DefaultBuildOperationRunner.execute(DefaultBuildOperationRunner.java:59)
    at org.gradle.internal.operations.DefaultBuildOperationRunner.call(DefaultBuildOperationRunner.java:53)
    at org.gradle.internal.operations.DefaultBuildOperationExecutor.call(DefaultBuildOperationExecutor.java:73)
    at org.gradle.api.internal.tasks.execution.EventFiringTaskExecuter.execute(EventFiringTaskExecuter.java:52)
    at org.gradle.execution.plan.LocalTaskNodeExecutor.execute(LocalTaskNodeExecutor.java:74)
    at org.gradle.execution.taskgraph.DefaultTaskExecutionGraph$InvokeNodeExecutorsAction.execute(DefaultTaskExecutionGraph.java:402)
    at org.gradle.execution.taskgraph.DefaultTaskExecutionGraph$InvokeNodeExecutorsAction.execute(DefaultTaskExecutionGraph.java:389)
    at org.gradle.execution.taskgraph.DefaultTaskExecutionGraph$BuildOperationAwareExecutionAction.execute(DefaultTaskExecutionGraph.java:382)
    at org.gradle.execution.taskgraph.DefaultTaskExecutionGraph$BuildOperationAwareExecutionAction.execute(DefaultTaskExecutionGraph.java:368)
    at org.gradle.execution.plan.DefaultPlanExecutor$ExecutorWorker.lambda$run$0(DefaultPlanExecutor.java:127)
    at org.gradle.execution.plan.DefaultPlanExecutor$ExecutorWorker.execute(DefaultPlanExecutor.java:191)
    at org.gradle.execution.plan.DefaultPlanExecutor$ExecutorWorker.executeNextNode(DefaultPlanExecutor.java:182)
    at org.gradle.execution.plan.DefaultPlanExecutor$ExecutorWorker.run(DefaultPlanExecutor.java:124)
    at org.gradle.execution.plan.DefaultPlanExecutor.process(DefaultPlanExecutor.java:72)
    at org.gradle.execution.taskgraph.DefaultTaskExecutionGraph.executeWithServices(DefaultTaskExecutionGraph.java:187)
    at org.gradle.execution.taskgraph.DefaultTaskExecutionGraph.execute(DefaultTaskExecutionGraph.java:180)
    at org.gradle.execution.SelectedTaskExecutionAction.execute(SelectedTaskExecutionAction.java:39)
    at org.gradle.execution.DefaultBuildWorkExecutor.execute(DefaultBuildWorkExecutor.java:44)
    at org.gradle.execution.DefaultBuildWorkExecutor.access$000(DefaultBuildWorkExecutor.java:26)
    at org.gradle.execution.DefaultBuildWorkExecutor$1.proceed(DefaultBuildWorkExecutor.java:52)
    at org.gradle.execution.DryRunBuildExecutionAction.execute(DryRunBuildExecutionAction.java:49)
    at org.gradle.execution.DefaultBuildWorkExecutor.execute(DefaultBuildWorkExecutor.java:44)
    at org.gradle.execution.DefaultBuildWorkExecutor.execute(DefaultBuildWorkExecutor.java:36)
    at org.gradle.execution.BuildOperationFiringBuildWorkerExecutor$ExecuteTasks.call(BuildOperationFiringBuildWorkerExecutor.java:51)
    at org.gradle.execution.BuildOperationFiringBuildWorkerExecutor$ExecuteTasks.call(BuildOperationFiringBuildWorkerExecutor.java:42)
    at org.gradle.internal.operations.DefaultBuildOperationRunner$CallableBuildOperationWorker.execute(DefaultBuildOperationRunner.java:204)
    at org.gradle.internal.operations.DefaultBuildOperationRunner$CallableBuildOperationWorker.execute(DefaultBuildOperationRunner.java:199)
    at org.gradle.internal.operations.DefaultBuildOperationRunner$2.execute(DefaultBuildOperationRunner.java:66)
    at org.gradle.internal.operations.DefaultBuildOperationRunner$2.execute(DefaultBuildOperationRunner.java:59)
    at org.gradle.internal.operations.DefaultBuildOperationRunner.execute(DefaultBuildOperationRunner.java:157)
    at org.gradle.internal.operations.DefaultBuildOperationRunner.execute(DefaultBuildOperationRunner.java:59)
    at org.gradle.internal.operations.DefaultBuildOperationRunner.call(DefaultBuildOperationRunner.java:53)
    at org.gradle.internal.operations.DefaultBuildOperationExecutor.call(DefaultBuildOperationExecutor.java:73)
    at org.gradle.execution.BuildOperationFiringBuildWorkerExecutor.execute(BuildOperationFiringBuildWorkerExecutor.java:39)
    at org.gradle.internal.build.DefaultBuildLifecycleController.lambda$executeTasks$3(DefaultBuildLifecycleController.java:136)
    at org.gradle.internal.build.StateTransitionController.doTransition(StateTransitionController.java:243)
    at org.gradle.internal.build.StateTransitionController.tryTransition(StateTransitionController.java:158)
    at org.gradle.internal.build.DefaultBuildLifecycleController.executeTasks(DefaultBuildLifecycleController.java:136)
    at org.gradle.internal.buildtree.DefaultBuildTreeWorkExecutor.execute(DefaultBuildTreeWorkExecutor.java:35)
    at org.gradle.internal.buildtree.BuildOperationFiringBuildTreeWorkExecutor$1.call(BuildOperationFiringBuildTreeWorkExecutor.java:40)
    at org.gradle.internal.buildtree.BuildOperationFiringBuildTreeWorkExecutor$1.call(BuildOperationFiringBuildTreeWorkExecutor.java:37)
    at org.gradle.internal.operations.DefaultBuildOperationRunner$CallableBuildOperationWorker.execute(DefaultBuildOperationRunner.java:204)
    at org.gradle.internal.operations.DefaultBuildOperationRunner$CallableBuildOperationWorker.execute(DefaultBuildOperationRunner.java:199)
    at org.gradle.internal.operations.DefaultBuildOperationRunner$2.execute(DefaultBuildOperationRunner.java:66)
    at org.gradle.internal.operations.DefaultBuildOperationRunner$2.execute(DefaultBuildOperationRunner.java:59)
    at org.gradle.internal.operations.DefaultBuildOperationRunner.execute(DefaultBuildOperationRunner.java:157)
    at org.gradle.internal.operations.DefaultBuildOperationRunner.execute(DefaultBuildOperationRunner.java:59)
    at org.gradle.internal.operations.DefaultBuildOperationRunner.call(DefaultBuildOperationRunner.java:53)
    at org.gradle.internal.operations.DefaultBuildOperationExecutor.call(DefaultBuildOperationExecutor.java:73)
    at org.gradle.internal.buildtree.BuildOperationFiringBuildTreeWorkExecutor.execute(BuildOperationFiringBuildTreeWorkExecutor.java:37)
    at org.gradle.internal.buildtree.DefaultBuildTreeLifecycleController.lambda$doScheduleAndRunTasks$2(DefaultBuildTreeLifecycleController.java:87)
    at org.gradle.composite.internal.DefaultIncludedBuildTaskGraph.withNewTaskGraph(DefaultIncludedBuildTaskGraph.java:94)
    at org.gradle.internal.buildtree.DefaultBuildTreeLifecycleController.doScheduleAndRunTasks(DefaultBuildTreeLifecycleController.java:85)
    at org.gradle.internal.buildtree.DefaultBuildTreeLifecycleController.lambda$runBuild$4(DefaultBuildTreeLifecycleController.java:103)
    at org.gradle.internal.build.StateTransitionController.lambda$transition$0(StateTransitionController.java:145)
    at org.gradle.internal.build.StateTransitionController.doTransition(StateTransitionController.java:243)
    at org.gradle.internal.build.StateTransitionController.transition(StateTransitionController.java:145)
    at org.gradle.internal.buildtree.DefaultBuildTreeLifecycleController.runBuild(DefaultBuildTreeLifecycleController.java:100)
    at org.gradle.internal.buildtree.DefaultBuildTreeLifecycleController.scheduleAndRunTasks(DefaultBuildTreeLifecycleController.java:66)
    at org.gradle.tooling.internal.provider.ExecuteBuildActionRunner.run(ExecuteBuildActionRunner.java:31)
    at org.gradle.launcher.exec.ChainingBuildActionRunner.run(ChainingBuildActionRunner.java:35)
    at org.gradle.internal.buildtree.ProblemReportingBuildActionRunner.run(ProblemReportingBuildActionRunner.java:49)
    at org.gradle.launcher.exec.BuildOutcomeReportingBuildActionRunner.run(BuildOutcomeReportingBuildActionRunner.java:69)
    at org.gradle.tooling.internal.provider.FileSystemWatchingBuildActionRunner.run(FileSystemWatchingBuildActionRunner.java:114)
    at org.gradle.launcher.exec.BuildCompletionNotifyingBuildActionRunner.run(BuildCompletionNotifyingBuildActionRunner.java:41)
    at org.gradle.launcher.exec.RootBuildLifecycleBuildActionExecutor.lambda$execute$0(RootBuildLifecycleBuildActionExecutor.java:40)
    at org.gradle.composite.internal.DefaultRootBuildState.run(DefaultRootBuildState.java:155)
    at org.gradle.launcher.exec.RootBuildLifecycleBuildActionExecutor.execute(RootBuildLifecycleBuildActionExecutor.java:40)
    at org.gradle.internal.buildtree.DefaultBuildTreeContext.execute(DefaultBuildTreeContext.java:40)
    at org.gradle.launcher.exec.BuildTreeLifecycleBuildActionExecutor.lambda$execute$0(BuildTreeLifecycleBuildActionExecutor.java:65)
    at org.gradle.internal.buildtree.BuildTreeState.run(BuildTreeState.java:53)
    at org.gradle.launcher.exec.BuildTreeLifecycleBuildActionExecutor.execute(BuildTreeLifecycleBuildActionExecutor.java:65)
    at org.gradle.launcher.exec.RunAsBuildOperationBuildActionExecutor$3.call(RunAsBuildOperationBuildActionExecutor.java:61)
    at org.gradle.launcher.exec.RunAsBuildOperationBuildActionExecutor$3.call(RunAsBuildOperationBuildActionExecutor.java:57)
    at org.gradle.internal.operations.DefaultBuildOperationRunner$CallableBuildOperationWorker.execute(DefaultBuildOperationRunner.java:204)
    at org.gradle.internal.operations.DefaultBuildOperationRunner$CallableBuildOperationWorker.execute(DefaultBuildOperationRunner.java:199)
    at org.gradle.internal.operations.DefaultBuildOperationRunner$2.execute(DefaultBuildOperationRunner.java:66)
    at org.gradle.internal.operations.DefaultBuildOperationRunner$2.execute(DefaultBuildOperationRunner.java:59)
    at org.gradle.internal.operations.DefaultBuildOperationRunner.execute(DefaultBuildOperationRunner.java:157)
    at org.gradle.internal.operations.DefaultBuildOperationRunner.execute(DefaultBuildOperationRunner.java:59)
    at org.gradle.internal.operations.DefaultBuildOperationRunner.call(DefaultBuildOperationRunner.java:53)
    at org.gradle.internal.operations.DefaultBuildOperationExecutor.call(DefaultBuildOperationExecutor.java:73)
    at org.gradle.launcher.exec.RunAsBuildOperationBuildActionExecutor.execute(RunAsBuildOperationBuildActionExecutor.java:57)
    at org.gradle.launcher.exec.RunAsWorkerThreadBuildActionExecutor.lambda$execute$0(RunAsWorkerThreadBuildActionExecutor.java:38)
    at org.gradle.internal.work.DefaultWorkerLeaseService.withLocks(DefaultWorkerLeaseService.java:211)
    at org.gradle.launcher.exec.RunAsWorkerThreadBuildActionExecutor.execute(RunAsWorkerThreadBuildActionExecutor.java:38)
    at org.gradle.tooling.internal.provider.ContinuousBuildActionExecutor.execute(ContinuousBuildActionExecutor.java:103)
    at org.gradle.tooling.internal.provider.SubscribableBuildActionExecutor.execute(SubscribableBuildActionExecutor.java:64)
    at org.gradle.internal.session.DefaultBuildSessionContext.execute(DefaultBuildSessionContext.java:46)
    at org.gradle.tooling.internal.provider.BuildSessionLifecycleBuildActionExecuter$ActionImpl.apply(BuildSessionLifecycleBuildActionExecuter.java:100)
    at org.gradle.tooling.internal.provider.BuildSessionLifecycleBuildActionExecuter$ActionImpl.apply(BuildSessionLifecycleBuildActionExecuter.java:88)
    at org.gradle.internal.session.BuildSessionState.run(BuildSessionState.java:69)
    at org.gradle.tooling.internal.provider.BuildSessionLifecycleBuildActionExecuter.execute(BuildSessionLifecycleBuildActionExecuter.java:62)
    at org.gradle.tooling.internal.provider.BuildSessionLifecycleBuildActionExecuter.execute(BuildSessionLifecycleBuildActionExecuter.java:41)
    at org.gradle.tooling.internal.provider.GradleThreadBuildActionExecuter.execute(GradleThreadBuildActionExecuter.java:36)
    at org.gradle.tooling.internal.provider.GradleThreadBuildActionExecuter.execute(GradleThreadBuildActionExecuter.java:25)
    at org.gradle.tooling.internal.provider.StartParamsValidatingActionExecuter.execute(StartParamsValidatingActionExecuter.java:63)
    at org.gradle.tooling.internal.provider.StartParamsValidatingActionExecuter.execute(StartParamsValidatingActionExecuter.java:31)
    at org.gradle.tooling.internal.provider.SessionFailureReportingActionExecuter.execute(SessionFailureReportingActionExecuter.java:58)
    at org.gradle.tooling.internal.provider.SessionFailureReportingActionExecuter.execute(SessionFailureReportingActionExecuter.java:42)
    at org.gradle.tooling.internal.provider.SetupLoggingActionExecuter.execute(SetupLoggingActionExecuter.java:47)
    at org.gradle.tooling.internal.provider.SetupLoggingActionExecuter.execute(SetupLoggingActionExecuter.java:31)
    at org.gradle.launcher.daemon.server.exec.ExecuteBuild.doBuild(ExecuteBuild.java:65)
    at org.gradle.launcher.daemon.server.exec.BuildCommandOnly.execute(BuildCommandOnly.java:37)
    at org.gradle.launcher.daemon.server.api.DaemonCommandExecution.proceed(DaemonCommandExecution.java:104)
    at org.gradle.launcher.daemon.server.exec.WatchForDisconnection.execute(WatchForDisconnection.java:39)
    at org.gradle.launcher.daemon.server.api.DaemonCommandExecution.proceed(DaemonCommandExecution.java:104)
    at org.gradle.launcher.daemon.server.exec.ResetDeprecationLogger.execute(ResetDeprecationLogger.java:29)
    at org.gradle.launcher.daemon.server.api.DaemonCommandExecution.proceed(DaemonCommandExecution.java:104)
    at org.gradle.launcher.daemon.server.exec.RequestStopIfSingleUsedDaemon.execute(RequestStopIfSingleUsedDaemon.java:35)
    at org.gradle.launcher.daemon.server.api.DaemonCommandExecution.proceed(DaemonCommandExecution.java:104)
    at org.gradle.launcher.daemon.server.exec.ForwardClientInput$2.create(ForwardClientInput.java:78)
    at org.gradle.launcher.daemon.server.exec.ForwardClientInput$2.create(ForwardClientInput.java:75)
    at org.gradle.util.internal.Swapper.swap(Swapper.java:38)
    at org.gradle.launcher.daemon.server.exec.ForwardClientInput.execute(ForwardClientInput.java:75)
    at org.gradle.launcher.daemon.server.api.DaemonCommandExecution.proceed(DaemonCommandExecution.java:104)
    at org.gradle.launcher.daemon.server.exec.LogAndCheckHealth.execute(LogAndCheckHealth.java:55)
    at org.gradle.launcher.daemon.server.api.DaemonCommandExecution.proceed(DaemonCommandExecution.java:104)
    at org.gradle.launcher.daemon.server.exec.LogToClient.doBuild(LogToClient.java:63)
    at org.gradle.launcher.daemon.server.exec.BuildCommandOnly.execute(BuildCommandOnly.java:37)
    at org.gradle.launcher.daemon.server.api.DaemonCommandExecution.proceed(DaemonCommandExecution.java:104)
    at org.gradle.launcher.daemon.server.exec.EstablishBuildEnvironment.doBuild(EstablishBuildEnvironment.java:84)
    at org.gradle.launcher.daemon.server.exec.BuildCommandOnly.execute(BuildCommandOnly.java:37)
    at org.gradle.launcher.daemon.server.api.DaemonCommandExecution.proceed(DaemonCommandExecution.java:104)
    at org.gradle.launcher.daemon.server.exec.StartBuildOrRespondWithBusy$1.run(StartBuildOrRespondWithBusy.java:52)
    at org.gradle.launcher.daemon.server.DaemonStateCoordinator$1.run(DaemonStateCoordinator.java:297)
    at org.gradle.internal.concurrent.ExecutorPolicy$CatchAndRecordFailures.onExecute(ExecutorPolicy.java:64)
    at org.gradle.internal.concurrent.ManagedExecutorImpl$1.run(ManagedExecutorImpl.java:48)
    at org.gradle.internal.concurrent.ThreadFactoryImpl$ManagedThreadRunnable.run(ThreadFactoryImpl.java:61)
    Caused by: org.gradle.workers.internal.DefaultWorkerExecutor$WorkExecutionException: A failure occurred while executing com.android.build.gradle.internal.tasks.CheckDuplicatesRunnable
    at org.gradle.workers.internal.DefaultWorkerExecutor$WorkItemExecution.waitForCompletion(DefaultWorkerExecutor.java:342)
    at org.gradle.internal.work.DefaultAsyncWorkTracker.waitForItemsAndGatherFailures(DefaultAsyncWorkTracker.java:142)
    at org.gradle.internal.work.DefaultAsyncWorkTracker.waitForItemsAndGatherFailures(DefaultAsyncWorkTracker.java:94)
    at org.gradle.internal.work.DefaultAsyncWorkTracker.waitForAll(DefaultAsyncWorkTracker.java:80)
    at org.gradle.internal.work.DefaultAsyncWorkTracker.waitForCompletion(DefaultAsyncWorkTracker.java:68)
    at org.gradle.api.internal.tasks.execution.TaskExecution$2.run(TaskExecution.java:247)
    at org.gradle.internal.operations.DefaultBuildOperationRunner$1.execute(DefaultBuildOperationRunner.java:29)
    at org.gradle.internal.operations.DefaultBuildOperationRunner$1.execute(DefaultBuildOperationRunner.java:26)
    at org.gradle.internal.operations.DefaultBuildOperationRunner$2.execute(DefaultBuildOperationRunner.java:66)
    at org.gradle.internal.operations.DefaultBuildOperationRunner$2.execute(DefaultBuildOperationRunner.java:59)
    at org.gradle.internal.operations.DefaultBuildOperationRunner.execute(DefaultBuildOperationRunner.java:157)
    at org.gradle.internal.operations.DefaultBuildOperationRunner.execute(DefaultBuildOperationRunner.java:59)
    at org.gradle.internal.operations.DefaultBuildOperationRunner.run(DefaultBuildOperationRunner.java:47)
    at org.gradle.internal.operations.DefaultBuildOperationExecutor.run(DefaultBuildOperationExecutor.java:68)
    at org.gradle.api.internal.tasks.execution.TaskExecution.executeAction(TaskExecution.java:224)
    at org.gradle.api.internal.tasks.execution.TaskExecution.executeActions(TaskExecution.java:207)
    at org.gradle.api.internal.tasks.execution.TaskExecution.executeWithPreviousOutputFiles(TaskExecution.java:190)
    at org.gradle.api.internal.tasks.execution.TaskExecution.execute(TaskExecution.java:168)
    at org.gradle.internal.execution.steps.ExecuteStep.executeInternal(ExecuteStep.java:89)
    at org.gradle.internal.execution.steps.ExecuteStep.access$000(ExecuteStep.java:40)
    at org.gradle.internal.execution.steps.ExecuteStep$1.call(ExecuteStep.java:53)
    at org.gradle.internal.execution.steps.ExecuteStep$1.call(ExecuteStep.java:50)
    at org.gradle.internal.operations.DefaultBuildOperationRunner$CallableBuildOperationWorker.execute(DefaultBuildOperationRunner.java:204)
    at org.gradle.internal.operations.DefaultBuildOperationRunner$CallableBuildOperationWorker.execute(DefaultBuildOperationRunner.java:199)
    at org.gradle.internal.operations.DefaultBuildOperationRunner$2.execute(DefaultBuildOperationRunner.java:66)
    at org.gradle.internal.operations.DefaultBuildOperationRunner$2.execute(DefaultBuildOperationRunner.java:59)
    at org.gradle.internal.operations.DefaultBuildOperationRunner.execute(DefaultBuildOperationRunner.java:157)
    at org.gradle.internal.operations.DefaultBuildOperationRunner.execute(DefaultBuildOperationRunner.java:59)
    at org.gradle.internal.operations.DefaultBuildOperationRunner.call(DefaultBuildOperationRunner.java:53)
    at org.gradle.internal.operations.DefaultBuildOperationExecutor.call(DefaultBuildOperationExecutor.java:73)
    at org.gradle.internal.execution.steps.ExecuteStep.execute(ExecuteStep.java:50)
    at org.gradle.internal.execution.steps.ExecuteStep.execute(ExecuteStep.java:40)
    at org.gradle.internal.execution.steps.RemovePreviousOutputsStep.execute(RemovePreviousOutputsStep.java:68)
    at org.gradle.internal.execution.steps.RemovePreviousOutputsStep.execute(RemovePreviousOutputsStep.java:38)
    at org.gradle.internal.execution.steps.ResolveInputChangesStep.execute(ResolveInputChangesStep.java:48)
    at org.gradle.internal.execution.steps.ResolveInputChangesStep.execute(ResolveInputChangesStep.java:36)
    at org.gradle.internal.execution.steps.CancelExecutionStep.execute(CancelExecutionStep.java:41)
    at org.gradle.internal.execution.steps.TimeoutStep.executeWithoutTimeout(TimeoutStep.java:74)
    at org.gradle.internal.execution.steps.TimeoutStep.execute(TimeoutStep.java:55)
    at org.gradle.internal.execution.steps.CreateOutputsStep.execute(CreateOutputsStep.java:51)
    at org.gradle.internal.execution.steps.CreateOutputsStep.execute(CreateOutputsStep.java:29)
    at org.gradle.internal.execution.steps.CaptureStateAfterExecutionStep.execute(CaptureStateAfterExecutionStep.java:61)
    at org.gradle.internal.execution.steps.CaptureStateAfterExecutionStep.execute(CaptureStateAfterExecutionStep.java:42)
    at org.gradle.internal.execution.steps.BroadcastChangingOutputsStep.execute(BroadcastChangingOutputsStep.java:60)
    at org.gradle.internal.execution.steps.BroadcastChangingOutputsStep.execute(BroadcastChangingOutputsStep.java:27)
    at org.gradle.internal.execution.steps.BuildCacheStep.executeWithoutCache(BuildCacheStep.java:188)
    at org.gradle.internal.execution.steps.BuildCacheStep.lambda$execute$1(BuildCacheStep.java:75)
    at org.gradle.internal.Either$Right.fold(Either.java:175)
    at org.gradle.internal.execution.caching.CachingState.fold(CachingState.java:59)
    at org.gradle.internal.execution.steps.BuildCacheStep.execute(BuildCacheStep.java:73)
    at org.gradle.internal.execution.steps.BuildCacheStep.execute(BuildCacheStep.java:48)
    at org.gradle.internal.execution.steps.StoreExecutionStateStep.execute(StoreExecutionStateStep.java:38)
    at org.gradle.internal.execution.steps.StoreExecutionStateStep.execute(StoreExecutionStateStep.java:27)
    at org.gradle.internal.execution.steps.RecordOutputsStep.execute(RecordOutputsStep.java:36)
    at org.gradle.internal.execution.steps.RecordOutputsStep.execute(RecordOutputsStep.java:22)
    at org.gradle.internal.execution.steps.SkipUpToDateStep.executeBecause(SkipUpToDateStep.java:109)
    at org.gradle.internal.execution.steps.SkipUpToDateStep.lambda$execute$2(SkipUpToDateStep.java:56)
    at org.gradle.internal.execution.steps.SkipUpToDateStep.execute(SkipUpToDateStep.java:56)
    at org.gradle.internal.execution.steps.SkipUpToDateStep.execute(SkipUpToDateStep.java:38)
    at org.gradle.internal.execution.steps.ResolveChangesStep.execute(ResolveChangesStep.java:73)
    at org.gradle.internal.execution.steps.ResolveChangesStep.execute(ResolveChangesStep.java:44)
    at org.gradle.internal.execution.steps.legacy.MarkSnapshottingInputsFinishedStep.execute(MarkSnapshottingInputsFinishedStep.java:37)
    at org.gradle.internal.execution.steps.legacy.MarkSnapshottingInputsFinishedStep.execute(MarkSnapshottingInputsFinishedStep.java:27)
    at org.gradle.internal.execution.steps.ResolveCachingStateStep.execute(ResolveCachingStateStep.java:89)
    at org.gradle.internal.execution.steps.ResolveCachingStateStep.execute(ResolveCachingStateStep.java:50)
    at org.gradle.internal.execution.steps.ValidateStep.execute(ValidateStep.java:114)
    at org.gradle.internal.execution.steps.ValidateStep.execute(ValidateStep.java:57)
    at org.gradle.internal.execution.steps.CaptureStateBeforeExecutionStep.execute(CaptureStateBeforeExecutionStep.java:76)
    at org.gradle.internal.execution.steps.CaptureStateBeforeExecutionStep.execute(CaptureStateBeforeExecutionStep.java:50)
    at org.gradle.internal.execution.steps.SkipEmptyWorkStep.lambda$execute$2(SkipEmptyWorkStep.java:93)
    at org.gradle.internal.execution.steps.SkipEmptyWorkStep.execute(SkipEmptyWorkStep.java:93)
    at org.gradle.internal.execution.steps.SkipEmptyWorkStep.execute(SkipEmptyWorkStep.java:34)
    at org.gradle.internal.execution.steps.legacy.MarkSnapshottingInputsStartedStep.execute(MarkSnapshottingInputsStartedStep.java:38)
    at org.gradle.internal.execution.steps.LoadPreviousExecutionStateStep.execute(LoadPreviousExecutionStateStep.java:43)
    at org.gradle.internal.execution.steps.LoadPreviousExecutionStateStep.execute(LoadPreviousExecutionStateStep.java:31)
    at org.gradle.internal.execution.steps.AssignWorkspaceStep.lambda$execute$0(AssignWorkspaceStep.java:40)
    at org.gradle.api.internal.tasks.execution.TaskExecution$3.withWorkspace(TaskExecution.java:284)
    at org.gradle.internal.execution.steps.AssignWorkspaceStep.execute(AssignWorkspaceStep.java:40)
    at org.gradle.internal.execution.steps.AssignWorkspaceStep.execute(AssignWorkspaceStep.java:30)
    at org.gradle.internal.execution.steps.IdentityCacheStep.execute(IdentityCacheStep.java:37)
    at org.gradle.internal.execution.steps.IdentityCacheStep.execute(IdentityCacheStep.java:27)
    at org.gradle.internal.execution.steps.IdentifyStep.execute(IdentifyStep.java:44)
    at org.gradle.internal.execution.steps.IdentifyStep.execute(IdentifyStep.java:33)
    at org.gradle.internal.execution.impl.DefaultExecutionEngine$1.execute(DefaultExecutionEngine.java:76)
    at org.gradle.api.internal.tasks.execution.ExecuteActionsTaskExecuter.executeIfValid(ExecuteActionsTaskExecuter.java:142)
    at org.gradle.api.internal.tasks.execution.ExecuteActionsTaskExecuter.execute(ExecuteActionsTaskExecuter.java:131)
    at org.gradle.api.internal.tasks.execution.CleanupStaleOutputsExecuter.execute(CleanupStaleOutputsExecuter.java:77)
    at org.gradle.api.internal.tasks.execution.FinalizePropertiesTaskExecuter.execute(FinalizePropertiesTaskExecuter.java:46)
    at org.gradle.api.internal.tasks.execution.ResolveTaskExecutionModeExecuter.execute(ResolveTaskExecutionModeExecuter.java:51)
    at org.gradle.api.internal.tasks.execution.SkipTaskWithNoActionsExecuter.execute(SkipTaskWithNoActionsExecuter.java:57)
    at org.gradle.api.internal.tasks.execution.SkipOnlyIfTaskExecuter.execute(SkipOnlyIfTaskExecuter.java:56)
    at org.gradle.api.internal.tasks.execution.CatchExceptionTaskExecuter.execute(CatchExceptionTaskExecuter.java:36)
    at org.gradle.api.internal.tasks.execution.EventFiringTaskExecuter$1.executeTask(EventFiringTaskExecuter.java:77)
    at org.gradle.api.internal.tasks.execution.EventFiringTaskExecuter$1.call(EventFiringTaskExecuter.java:55)
    at org.gradle.api.internal.tasks.execution.EventFiringTaskExecuter$1.call(EventFiringTaskExecuter.java:52)
    at org.gradle.internal.operations.DefaultBuildOperationRunner$CallableBuildOperationWorker.execute(DefaultBuildOperationRunner.java:204)
    at org.gradle.internal.operations.DefaultBuildOperationRunner$CallableBuildOperationWorker.execute(DefaultBuildOperationRunner.java:199)
    at org.gradle.internal.operations.DefaultBuildOperationRunner$2.execute(DefaultBuildOperationRunner.java:66)
    at org.gradle.internal.operations.DefaultBuildOperationRunner$2.execute(DefaultBuildOperationRunner.java:59)
    at org.gradle.internal.operations.DefaultBuildOperationRunner.execute(DefaultBuildOperationRunner.java:157)
    at org.gradle.internal.operations.DefaultBuildOperationRunner.execute(DefaultBuildOperationRunner.java:59)
    at org.gradle.internal.operations.DefaultBuildOperationRunner.call(DefaultBuildOperationRunner.java:53)
    at org.gradle.internal.operations.DefaultBuildOperationExecutor.call(DefaultBuildOperationExecutor.java:73)
    at org.gradle.api.internal.tasks.execution.EventFiringTaskExecuter.execute(EventFiringTaskExecuter.java:52)
    at org.gradle.execution.plan.LocalTaskNodeExecutor.execute(LocalTaskNodeExecutor.java:74)
    at org.gradle.execution.taskgraph.DefaultTaskExecutionGraph$InvokeNodeExecutorsAction.execute(DefaultTaskExecutionGraph.java:402)
    at org.gradle.execution.taskgraph.DefaultTaskExecutionGraph$InvokeNodeExecutorsAction.execute(DefaultTaskExecutionGraph.java:389)
    at org.gradle.execution.taskgraph.DefaultTaskExecutionGraph$BuildOperationAwareExecutionAction.execute(DefaultTaskExecutionGraph.java:382)
    at org.gradle.execution.taskgraph.DefaultTaskExecutionGraph$BuildOperationAwareExecutionAction.execute(DefaultTaskExecutionGraph.java:368)
    at org.gradle.execution.plan.DefaultPlanExecutor$ExecutorWorker.lambda$run$0(DefaultPlanExecutor.java:127)
    at org.gradle.execution.plan.DefaultPlanExecutor$ExecutorWorker.execute(DefaultPlanExecutor.java:191)
    at org.gradle.execution.plan.DefaultPlanExecutor$ExecutorWorker.executeNextNode(DefaultPlanExecutor.java:182)
    at org.gradle.execution.plan.DefaultPlanExecutor$ExecutorWorker.run(DefaultPlanExecutor.java:124)
    at org.gradle.execution.plan.DefaultPlanExecutor.process(DefaultPlanExecutor.java:72)
    at org.gradle.execution.taskgraph.DefaultTaskExecutionGraph.executeWithServices(DefaultTaskExecutionGraph.java:187)
    at org.gradle.execution.taskgraph.DefaultTaskExecutionGraph.execute(DefaultTaskExecutionGraph.java:180)
    at org.gradle.execution.SelectedTaskExecutionAction.execute(SelectedTaskExecutionAction.java:39)
    at org.gradle.execution.DefaultBuildWorkExecutor.execute(DefaultBuildWorkExecutor.java:44)
    at org.gradle.execution.DefaultBuildWorkExecutor.access$000(DefaultBuildWorkExecutor.java:26)
    at org.gradle.execution.DefaultBuildWorkExecutor$1.proceed(DefaultBuildWorkExecutor.java:52)
    at org.gradle.execution.DryRunBuildExecutionAction.execute(DryRunBuildExecutionAction.java:49)
    at org.gradle.execution.DefaultBuildWorkExecutor.execute(DefaultBuildWorkExecutor.java:44)
    at org.gradle.execution.DefaultBuildWorkExecutor.execute(DefaultBuildWorkExecutor.java:36)
    at org.gradle.execution.BuildOperationFiringBuildWorkerExecutor$ExecuteTasks.call(BuildOperationFiringBuildWorkerExecutor.java:51)
    at org.gradle.execution.BuildOperationFiringBuildWorkerExecutor$ExecuteTasks.call(BuildOperationFiringBuildWorkerExecutor.java:42)
    at org.gradle.internal.operations.DefaultBuildOperationRunner$CallableBuildOperationWorker.execute(DefaultBuildOperationRunner.java:204)
    at org.gradle.internal.operations.DefaultBuildOperationRunner$CallableBuildOperationWorker.execute(DefaultBuildOperationRunner.java:199)
    at org.gradle.internal.operations.DefaultBuildOperationRunner$2.execute(DefaultBuildOperationRunner.java:66)
    at org.gradle.internal.operations.DefaultBuildOperationRunner$2.execute(DefaultBuildOperationRunner.java:59)
    at org.gradle.internal.operations.DefaultBuildOperationRunner.execute(DefaultBuildOperationRunner.java:157)
    at org.gradle.internal.operations.DefaultBuildOperationRunner.execute(DefaultBuildOperationRunner.java:59)
    at org.gradle.internal.operations.DefaultBuildOperationRunner.call(DefaultBuildOperationRunner.java:53)
    at org.gradle.internal.operations.DefaultBuildOperationExecutor.call(DefaultBuildOperationExecutor.java:73)
    at org.gradle.execution.BuildOperationFiringBuildWorkerExecutor.execute(BuildOperationFiringBuildWorkerExecutor.java:39)
    at org.gradle.internal.build.DefaultBuildLifecycleController.lambda$executeTasks$3(DefaultBuildLifecycleController.java:136)
    at org.gradle.internal.build.StateTransitionController.doTransition(StateTransitionController.java:243)
    at org.gradle.internal.build.StateTransitionController.tryTransition(StateTransitionController.java:158)
    at org.gradle.internal.build.DefaultBuildLifecycleController.executeTasks(DefaultBuildLifecycleController.java:136)
    at org.gradle.internal.buildtree.DefaultBuildTreeWorkExecutor.execute(DefaultBuildTreeWorkExecutor.java:35)
    at org.gradle.internal.buildtree.BuildOperationFiringBuildTreeWorkExecutor$1.call(BuildOperationFiringBuildTreeWorkExecutor.java:40)
    at org.gradle.internal.buildtree.BuildOperationFiringBuildTreeWorkExecutor$1.call(BuildOperationFiringBuildTreeWorkExecutor.java:37)
    at org.gradle.internal.operations.DefaultBuildOperationRunner$CallableBuildOperationWorker.execute(DefaultBuildOperationRunner.java:204)
    at org.gradle.internal.operations.DefaultBuildOperationRunner$CallableBuildOperationWorker.execute(DefaultBuildOperationRunner.java:199)
    at org.gradle.internal.operations.DefaultBuildOperationRunner$2.execute(DefaultBuildOperationRunner.java:66)
    at org.gradle.internal.operations.DefaultBuildOperationRunner$2.execute(DefaultBuildOperationRunner.java:59)
    at org.gradle.internal.operations.DefaultBuildOperationRunner.execute(DefaultBuildOperationRunner.java:157)
    at org.gradle.internal.operations.DefaultBuildOperationRunner.execute(DefaultBuildOperationRunner.java:59)
    at org.gradle.internal.operations.DefaultBuildOperationRunner.call(DefaultBuildOperationRunner.java:53)
    at org.gradle.internal.operations.DefaultBuildOperationExecutor.call(DefaultBuildOperationExecutor.java:73)
    at org.gradle.internal.buildtree.BuildOperationFiringBuildTreeWorkExecutor.execute(BuildOperationFiringBuildTreeWorkExecutor.java:37)
    at org.gradle.internal.buildtree.DefaultBuildTreeLifecycleController.lambda$doScheduleAndRunTasks$2(DefaultBuildTreeLifecycleController.java:87)
    at org.gradle.composite.internal.DefaultIncludedBuildTaskGraph.withNewTaskGraph(DefaultIncludedBuildTaskGraph.java:94)
    at org.gradle.internal.buildtree.DefaultBuildTreeLifecycleController.doScheduleAndRunTasks(DefaultBuildTreeLifecycleController.java:85)
    at org.gradle.internal.buildtree.DefaultBuildTreeLifecycleController.lambda$runBuild$4(DefaultBuildTreeLifecycleController.java:103)
    at org.gradle.internal.build.StateTransitionController.lambda$transition$0(StateTransitionController.java:145)
    at org.gradle.internal.build.StateTransitionController.doTransition(StateTransitionController.java:243)
    at org.gradle.internal.build.StateTransitionController.transition(StateTransitionController.java:145)
    at org.gradle.internal.buildtree.DefaultBuildTreeLifecycleController.runBuild(DefaultBuildTreeLifecycleController.java:100)
    at org.gradle.internal.buildtree.DefaultBuildTreeLifecycleController.scheduleAndRunTasks(DefaultBuildTreeLifecycleController.java:66)
    at org.gradle.tooling.internal.provider.ExecuteBuildActionRunner.run(ExecuteBuildActionRunner.java:31)
    at org.gradle.launcher.exec.ChainingBuildActionRunner.run(ChainingBuildActionRunner.java:35)
    at org.gradle.internal.buildtree.ProblemReportingBuildActionRunner.run(ProblemReportingBuildActionRunner.java:49)
    at org.gradle.launcher.exec.BuildOutcomeReportingBuildActionRunner.run(BuildOutcomeReportingBuildActionRunner.java:69)
    at org.gradle.tooling.internal.provider.FileSystemWatchingBuildActionRunner.run(FileSystemWatchingBuildActionRunner.java:114)
    at org.gradle.launcher.exec.BuildCompletionNotifyingBuildActionRunner.run(BuildCompletionNotifyingBuildActionRunner.java:41)
    at org.gradle.launcher.exec.RootBuildLifecycleBuildActionExecutor.lambda$execute$0(RootBuildLifecycleBuildActionExecutor.java:40)
    at org.gradle.composite.internal.DefaultRootBuildState.run(DefaultRootBuildState.java:155)
    at org.gradle.launcher.exec.RootBuildLifecycleBuildActionExecutor.execute(RootBuildLifecycleBuildActionExecutor.java:40)
    at org.gradle.internal.buildtree.DefaultBuildTreeContext.execute(DefaultBuildTreeContext.java:40)
    at org.gradle.launcher.exec.BuildTreeLifecycleBuildActionExecutor.lambda$execute$0(BuildTreeLifecycleBuildActionExecutor.java:65)
    at org.gradle.internal.buildtree.BuildTreeState.run(BuildTreeState.java:53)
    at org.gradle.launcher.exec.BuildTreeLifecycleBuildActionExecutor.execute(BuildTreeLifecycleBuildActionExecutor.java:65)
    at org.gradle.launcher.exec.RunAsBuildOperationBuildActionExecutor$3.call(RunAsBuildOperationBuildActionExecutor.java:61)
    at org.gradle.launcher.exec.RunAsBuildOperationBuildActionExecutor$3.call(RunAsBuildOperationBuildActionExecutor.java:57)
    at org.gradle.internal.operations.DefaultBuildOperationRunner$CallableBuildOperationWorker.execute(DefaultBuildOperationRunner.java:204)
    at org.gradle.internal.operations.DefaultBuildOperationRunner$CallableBuildOperationWorker.execute(DefaultBuildOperationRunner.java:199)
    at org.gradle.internal.operations.DefaultBuildOperationRunner$2.execute(DefaultBuildOperationRunner.java:66)
    at org.gradle.internal.operations.DefaultBuildOperationRunner$2.execute(DefaultBuildOperationRunner.java:59)
    at org.gradle.internal.operations.DefaultBuildOperationRunner.execute(DefaultBuildOperationRunner.java:157)
    at org.gradle.internal.operations.DefaultBuildOperationRunner.execute(DefaultBuildOperationRunner.java:59)
    at org.gradle.internal.operations.DefaultBuildOperationRunner.call(DefaultBuildOperationRunner.java:53)
    at org.gradle.internal.operations.DefaultBuildOperationExecutor.call(DefaultBuildOperationExecutor.java:73)
    at org.gradle.launcher.exec.RunAsBuildOperationBuildActionExecutor.execute(RunAsBuildOperationBuildActionExecutor.java:57)
    at org.gradle.launcher.exec.RunAsWorkerThreadBuildActionExecutor.lambda$execute$0(RunAsWorkerThreadBuildActionExecutor.java:38)
    at org.gradle.internal.work.DefaultWorkerLeaseService.withLocks(DefaultWorkerLeaseService.java:211)
    at org.gradle.launcher.exec.RunAsWorkerThreadBuildActionExecutor.execute(RunAsWorkerThreadBuildActionExecutor.java:38)
    at org.gradle.tooling.internal.provider.ContinuousBuildActionExecutor.execute(ContinuousBuildActionExecutor.java:103)
    at org.gradle.tooling.internal.provider.SubscribableBuildActionExecutor.execute(SubscribableBuildActionExecutor.java:64)
    at org.gradle.internal.session.DefaultBuildSessionContext.execute(DefaultBuildSessionContext.java:46)
    at org.gradle.tooling.internal.provider.BuildSessionLifecycleBuildActionExecuter$ActionImpl.apply(BuildSessionLifecycleBuildActionExecuter.java:100)
    at org.gradle.tooling.internal.provider.BuildSessionLifecycleBuildActionExecuter$ActionImpl.apply(BuildSessionLifecycleBuildActionExecuter.java:88)
    at org.gradle.internal.session.BuildSessionState.run(BuildSessionState.java:69)
    at org.gradle.tooling.internal.provider.BuildSessionLifecycleBuildActionExecuter.execute(BuildSessionLifecycleBuildActionExecuter.java:62)
    at org.gradle.tooling.internal.provider.BuildSessionLifecycleBuildActionExecuter.execute(BuildSessionLifecycleBuildActionExecuter.java:41)
    at org.gradle.tooling.internal.provider.GradleThreadBuildActionExecuter.execute(GradleThreadBuildActionExecuter.java:36)
    at org.gradle.tooling.internal.provider.GradleThreadBuildActionExecuter.execute(GradleThreadBuildActionExecuter.java:25)
    at org.gradle.tooling.internal.provider.StartParamsValidatingActionExecuter.execute(StartParamsValidatingActionExecuter.java:63)
    at org.gradle.tooling.internal.provider.StartParamsValidatingActionExecuter.execute(StartParamsValidatingActionExecuter.java:31)
    at org.gradle.tooling.internal.provider.SessionFailureReportingActionExecuter.execute(SessionFailureReportingActionExecuter.java:58)
    at org.gradle.tooling.internal.provider.SessionFailureReportingActionExecuter.execute(SessionFailureReportingActionExecuter.java:42)
    at org.gradle.tooling.internal.provider.SetupLoggingActionExecuter.execute(SetupLoggingActionExecuter.java:47)
    at org.gradle.tooling.internal.provider.SetupLoggingActionExecuter.execute(SetupLoggingActionExecuter.java:31)
    at org.gradle.launcher.daemon.server.exec.ExecuteBuild.doBuild(ExecuteBuild.java:65)
    at org.gradle.launcher.daemon.server.exec.BuildCommandOnly.execute(BuildCommandOnly.java:37)
    at org.gradle.launcher.daemon.server.api.DaemonCommandExecution.proceed(DaemonCommandExecution.java:104)
    at org.gradle.launcher.daemon.server.exec.WatchForDisconnection.execute(WatchForDisconnection.java:39)
    at org.gradle.launcher.daemon.server.api.DaemonCommandExecution.proceed(DaemonCommandExecution.java:104)
    at org.gradle.launcher.daemon.server.exec.ResetDeprecationLogger.execute(ResetDeprecationLogger.java:29)
    at org.gradle.launcher.daemon.server.api.DaemonCommandExecution.proceed(DaemonCommandExecution.java:104)
    at org.gradle.launcher.daemon.server.exec.RequestStopIfSingleUsedDaemon.execute(RequestStopIfSingleUsedDaemon.java:35)
    at org.gradle.launcher.daemon.server.api.DaemonCommandExecution.proceed(DaemonCommandExecution.java:104)
    at org.gradle.launcher.daemon.server.exec.ForwardClientInput$2.create(ForwardClientInput.java:78)
    at org.gradle.launcher.daemon.server.exec.ForwardClientInput$2.create(ForwardClientInput.java:75)
    at org.gradle.util.internal.Swapper.swap(Swapper.java:38)
    at org.gradle.launcher.daemon.server.exec.ForwardClientInput.execute(ForwardClientInput.java:75)
    at org.gradle.launcher.daemon.server.api.DaemonCommandExecution.proceed(DaemonCommandExecution.java:104)
    at org.gradle.launcher.daemon.server.exec.LogAndCheckHealth.execute(LogAndCheckHealth.java:55)
    at org.gradle.launcher.daemon.server.api.DaemonCommandExecution.proceed(DaemonCommandExecution.java:104)
    at org.gradle.launcher.daemon.server.exec.LogToClient.doBuild(LogToClient.java:63)
    at org.gradle.launcher.daemon.server.exec.BuildCommandOnly.execute(BuildCommandOnly.java:37)
    at org.gradle.launcher.daemon.server.api.DaemonCommandExecution.proceed(DaemonCommandExecution.java:104)
    at org.gradle.launcher.daemon.server.exec.EstablishBuildEnvironment.doBuild(EstablishBuildEnvironment.java:84)
    at org.gradle.launcher.daemon.server.exec.BuildCommandOnly.execute(BuildCommandOnly.java:37)
    at org.gradle.launcher.daemon.server.api.DaemonCommandExecution.proceed(DaemonCommandExecution.java:104)
    at org.gradle.launcher.daemon.server.exec.StartBuildOrRespondWithBusy$1.run(StartBuildOrRespondWithBusy.java:52)
    at org.gradle.launcher.daemon.server.DaemonStateCoordinator$1.run(DaemonStateCoordinator.java:297)
    at org.gradle.internal.concurrent.ExecutorPolicy$CatchAndRecordFailures.onExecute(ExecutorPolicy.java:64)
    at org.gradle.internal.concurrent.ManagedExecutorImpl$1.run(ManagedExecutorImpl.java:48)
    at org.gradle.internal.concurrent.ThreadFactoryImpl$ManagedThreadRunnable.run(ThreadFactoryImpl.java:61)
    Caused by: java.lang.RuntimeException: Duplicate class com.hjq.permissions.AndroidManifestInfo found in modules jetified-XXPermissions-18.0-runtime (com.github.getActivity:XXPermissions:18.0) and jetified-utsplugin-release-runtime (utsplugin-release.aar)
    Duplicate class com.hjq.permissions.AndroidManifestInfo$ActivityInfo found in modules jetified-XXPermissions-18.0-runtime (com.github.getActivity:XXPermissions:18.0) and jetified-utsplugin-release-runtime (utsplugin-release.aar)
    Duplicate class com.hjq.permissions.AndroidManifestInfo$ApplicationInfo found in modules jetified-XXPermissions-18.0-runtime (com.github.getActivity:XXPermissions:18.0) and jetified-utsplugin-release-runtime (utsplugin-release.aar)
    Duplicate class com.hjq.permissions.AndroidManifestInfo$PermissionInfo found in modules jetified-XXPermissions-18.0-runtime (com.github.getActivity:XXPermissions:18.0) and jetified-utsplugin-release-runtime (utsplugin-release.aar)
    Duplicate class com.hjq.permissions.AndroidManifestInfo$ServiceInfo found in modules jetified-XXPermissions-18.0-runtime (com.github.getActivity:XXPermissions:18.0) and jetified-utsplugin-release-runtime (utsplugin-release.aar)
    Duplicate class com.hjq.permissions.AndroidManifestInfo$UsesSdkInfo found in modules jetified-XXPermissions-18.0-runtime (com.github.getActivity:XXPermissions:18.0) and jetified-utsplugin-release-runtime (utsplugin-release.aar)
    Duplicate class com.hjq.permissions.AndroidManifestParser found in modules jetified-XXPermissions-18.0-runtime (com.github.getActivity:XXPermissions:18.0) and jetified-utsplugin-release-runtime (utsplugin-release.aar)
    Duplicate class com.hjq.permissions.AndroidVersion found in modules jetified-XXPermissions-18.0-runtime (com.github.getActivity:XXPermissions:18.0) and jetified-utsplugin-release-runtime (utsplugin-release.aar)
    Duplicate class com.hjq.permissions.GetInstalledAppsPermissionCompat found in modules jetified-XXPermissions-18.0-runtime (com.github.getActivity:XXPermissions:18.0) and jetified-utsplugin-release-runtime (utsplugin-release.aar)
    Duplicate class com.hjq.permissions.IPermissionInterceptor found in modules jetified-XXPermissions-18.0-runtime (com.github.getActivity:XXPermissions:18.0) and jetified-utsplugin-release-runtime (utsplugin-release.aar)
    Duplicate class com.hjq.permissions.NotificationListenerPermissionCompat found in modules jetified-XXPermissions-18.0-runtime (com.github.getActivity:XXPermissions:18.0) and jetified-utsplugin-release-runtime (utsplugin-release.aar)
    Duplicate class com.hjq.permissions.NotificationPermissionCompat found in modules jetified-XXPermissions-18.0-runtime (com.github.getActivity:XXPermissions:18.0) and jetified-utsplugin-release-runtime (utsplugin-release.aar)
    Duplicate class com.hjq.permissions.OnPermissionCallback found in modules jetified-XXPermissions-18.0-runtime (com.github.getActivity:XXPermissions:18.0) and jetified-utsplugin-release-runtime (utsplugin-release.aar)
    Duplicate class com.hjq.permissions.OnPermissionPageCallback found in modules jetified-XXPermissions-18.0-runtime (com.github.getActivity:XXPermissions:18.0) and jetified-utsplugin-release-runtime (utsplugin-release.aar)
    Duplicate class com.hjq.permissions.Permission found in modules jetified-XXPermissions-18.0-runtime (com.github.getActivity:XXPermissions:18.0) and jetified-utsplugin-release-runtime (utsplugin-release.aar)
    Duplicate class com.hjq.permissions.Permission$Group found in modules jetified-XXPermissions-18.0-runtime (com.github.getActivity:XXPermissions:18.0) and jetified-utsplugin-release-runtime (utsplugin-release.aar)
    Duplicate class com.hjq.permissions.PermissionApi found in modules jetified-XXPermissions-18.0-runtime (com.github.getActivity:XXPermissions:18.0) and jetified-utsplugin-release-runtime (utsplugin-release.aar)
    Duplicate class com.hjq.permissions.PermissionChecker found in modules jetified-XXPermissions-18.0-runtime (com.github.getActivity:XXPermissions:18.0) and jetified-utsplugin-release-runtime (utsplugin-release.aar)
    Duplicate class com.hjq.permissions.PermissionDelegate found in modules jetified-XXPermissions-18.0-runtime (com.github.getActivity:XXPermissions:18.0) and jetified-utsplugin-release-runtime (utsplugin-release.aar)
    Duplicate class com.hjq.permissions.PermissionDelegateImplV14 found in modules jetified-XXPermissions-18.0-runtime (com.github.getActivity:XXPermissions:18.0) and jetified-utsplugin-release-runtime (utsplugin-release.aar)
    Duplicate class com.hjq.permissions.PermissionDelegateImplV18 found in modules jetified-XXPermissions-18.0-runtime (com.github.getActivity:XXPermissions:18.0) and jetified-utsplugin-release-runtime (utsplugin-release.aar)
    Duplicate class com.hjq.permissions.PermissionDelegateImplV19 found in modules jetified-XXPermissions-18.0-runtime (com.github.getActivity:XXPermissions:18.0) and jetified-utsplugin-release-runtime (utsplugin-release.aar)
    Duplicate class com.hjq.permissions.PermissionDelegateImplV21 found in modules jetified-XXPermissions-18.0-runtime (com.github.getActivity:XXPermissions:18.0) and jetified-utsplugin-release-runtime (utsplugin-release.aar)
    Duplicate class com.hjq.permissions.PermissionDelegateImplV23 found in modules jetified-XXPermissions-18.0-runtime (com.github.getActivity:XXPermissions:18.0) and jetified-utsplugin-release-runtime (utsplugin-release.aar)
    Duplicate class com.hjq.permissions.PermissionDelegateImplV26 found in modules jetified-XXPermissions-18.0-runtime (com.github.getActivity:XXPermissions:18.0) and jetified-utsplugin-release-runtime (utsplugin-release.aar)
    Duplicate class com.hjq.permissions.PermissionDelegateImplV28 found in modules jetified-XXPermissions-18.0-runtime (com.github.getActivity:XXPermissions:18.0) and jetified-utsplugin-release-runtime (utsplugin-release.aar)
    Duplicate class com.hjq.permissions.PermissionDelegateImplV29 found in modules jetified-XXPermissions-18.0-runtime (com.github.getActivity:XXPermissions:18.0) and jetified-utsplugin-release-runtime (utsplugin-release.aar)
    Duplicate class com.hjq.permissions.PermissionDelegateImplV30 found in modules jetified-XXPermissions-18.0-runtime (com.github.getActivity:XXPermissions:18.0) and jetified-utsplugin-release-runtime (utsplugin-release.aar)
    Duplicate class com.hjq.permissions.PermissionDelegateImplV31 found in modules jetified-XXPermissions-18.0-runtime (com.github.getActivity:XXPermissions:18.0) and jetified-utsplugin-release-runtime (utsplugin-release.aar)
    Duplicate class com.hjq.permissions.PermissionDelegateImplV33 found in modules jetified-XXPermissions-18.0-runtime (com.github.getActivity:XXPermissions:18.0) and jetified-utsplugin-release-runtime (utsplugin-release.aar)
    Duplicate class com.hjq.permissions.PermissionFragment found in modules jetified-XXPermissions-18.0-runtime (com.github.getActivity:XXPermissions:18.0) and jetified-utsplugin-release-runtime (utsplugin-release.aar)
    Duplicate class com.hjq.permissions.PermissionFragment$1 found in modules jetified-XXPermissions-18.0-runtime (com.github.getActivity:XXPermissions:18.0) and jetified-utsplugin-release-runtime (utsplugin-release.aar)
    Duplicate class com.hjq.permissions.PermissionFragment$2 found in modules jetified-XXPermissions-18.0-runtime (com.github.getActivity:XXPermissions:18.0) and jetified-utsplugin-release-runtime (utsplugin-release.aar)
    Duplicate class com.hjq.permissions.PermissionFragment$2$1 found in modules jetified-XXPermissions-18.0-runtime (com.github.getActivity:XXPermissions:18.0) and jetified-utsplugin-release-runtime (utsplugin-release.aar)
    Duplicate class com.hjq.permissions.PermissionFragment$2$2 found in modules jetified-XXPermissions-18.0-runtime (com.github.getActivity:XXPermissions:18.0) and jetified-utsplugin-release-runtime (utsplugin-release.aar)
    Duplicate class com.hjq.permissions.PermissionIntentManager found in modules jetified-XXPermissions-18.0-runtime (com.github.getActivity:XXPermissions:18.0) and jetified-utsplugin-release-runtime (utsplugin-release.aar)
    Duplicate class com.hjq.permissions.PermissionPageFragment found in modules jetified-XXPermissions-18.0-runtime (com.github.getActivity:XXPermissions:18.0) and jetified-utsplugin-release-runtime (utsplugin-release.aar)
    Duplicate class com.hjq.permissions.PermissionUtils found in modules jetified-XXPermissions-18.0-runtime (com.github.getActivity:XXPermissions:18.0) and jetified-utsplugin-release-runtime (utsplugin-release.aar)
    Duplicate class com.hjq.permissions.PhoneRomUtils found in modules jetified-XXPermissions-18.0-runtime (com.github.getActivity:XXPermissions:18.0) and jetified-utsplugin-release-runtime (utsplugin-release.aar)
    Duplicate class com.hjq.permissions.StartActivityManager found in modules jetified-XXPermissions-18.0-runtime (com.github.getActivity:XXPermissions:18.0) and jetified-utsplugin-release-runtime (utsplugin-release.aar)
    Duplicate class com.hjq.permissions.StartActivityManager$1 found in modules jetified-XXPermissions-18.0-runtime (com.github.getActivity:XXPermissions:18.0) and jetified-utsplugin-release-runtime (utsplugin-release.aar)
    Duplicate class com.hjq.permissions.StartActivityManager$IStartActivityDelegate found in modules jetified-XXPermissions-18.0-runtime (com.github.getActivity:XXPermissions:18.0) and jetified-utsplugin-release-runtime (utsplugin-release.aar)
    Duplicate class com.hjq.permissions.StartActivityManager$StartActivityDelegateActivityImpl found in modules jetified-XXPermissions-18.0-runtime (com.github.getActivity:XXPermissions:18.0) and jetified-utsplugin-release-runtime (utsplugin-release.aar)
    Duplicate class com.hjq.permissions.StartActivityManager$StartActivityDelegateContextImpl found in modules jetified-XXPermissions-18.0-runtime (com.github.getActivity:XXPermissions:18.0) and jetified-utsplugin-release-runtime (utsplugin-release.aar)
    Duplicate class com.hjq.permissions.StartActivityManager$StartActivityDelegateFragmentImpl found in modules jetified-XXPermissions-18.0-runtime (com.github.getActivity:XXPermissions:18.0) and jetified-utsplugin-release-runtime (utsplugin-release.aar)
    Duplicate class com.hjq.permissions.StartActivityManager$StartActivityDelegateSupportFragmentImpl found in modules jetified-XXPermissions-18.0-runtime (com.github.getActivity:XXPermissions:18.0) and jetified-utsplugin-release-runtime (utsplugin-release.aar)
    Duplicate class com.hjq.permissions.WindowPermissionCompat found in modules jetified-XXPermissions-18.0-runtime (com.github.getActivity:XXPermissions:18.0) and jetified-utsplugin-release-runtime (utsplugin-release.aar)
    Duplicate class com.hjq.permissions.XXPermissions found in modules jetified-XXPermissions-18.0-runtime (com.github.getActivity:XXPermissions:18.0) and jetified-utsplugin-release-runtime (utsplugin-release.aar)
    Duplicate class com.hjq.permissions.XXPermissions$1 found in modules jetified-XXPermissions-18.0-runtime (com.github.getActivity:XXPermissions:18.0) and jetified-utsplugin-release-runtime (utsplugin-release.aar)

Go to the documentation to learn how to Fix dependency resolution errors.
at com.android.build.gradle.internal.tasks.CheckDuplicateClassesDelegate.run(CheckDuplicateClassesDelegate.kt:71)
at com.android.build.gradle.internal.tasks.CheckDup

2023-08-03 17:43 负责人:无 分享
已邀请:
qingyou

qingyou (作者)

请问这个是什么插件出现问题冲突呢 ? 应该怎么解决呢

BoredApe

BoredApe - 有问题就会有答案。

A failure occurred while executing com.android.build.gradle.internal.tasks.CheckDuplicatesRunnable  
Duplicate class com.hjq.permissions.AndroidManifestInfo found in modules jetified-XXPermissions-18.0-runtime (com.github.getActivity:XXPermissions:18.0) and jetified-utsplugin-release-runtime (utsplugin-release.aar)

请参考:https://ask.dcloud.net.cn/question/171189

要回复问题请先登录注册